Discussion:
[binutils-gdb] RISC-V: Use pc-relative relocation for FDE initial location
(too old to reply)
sergiodj+
2017-06-27 01:48:40 UTC
Permalink
*** TEST RESULTS FOR COMMIT a6cbf936e3dce68114d28cdf60d510a3f78a6d40 ***

Author: Kuan-Lin Chen <***@andestech.com>
Branch: master
Commit: a6cbf936e3dce68114d28cdf60d510a3f78a6d40

RISC-V: Use pc-relative relocation for FDE initial location

The symbol address in .eh_frame may be adjusted in
_bfd_elf_discard_section_eh_frame, and the content of .eh_frame will be
adjusted in _bfd_elf_write_section_eh_frame. Therefore, we cannot insert
a relocation whose addend symbol is in .eh_frame. Othrewise, the value
may be adjusted twice.

bfd/ChangeLog
2017-06-26 Kuan-Lin Chen <***@andestech.com>

* elfnn-riscv.c (perform_relocation): Support the new
R_RISCV_32_PCREL relocation.
(riscv_elf_relocate_section): Likewise.
* elfxx-riscv.c (howto_table): Likewise.
(riscv_reloc_map): Likewise.
* bfd-in2.h (BFD_RELOC_RISCV_32_PCREL): New relocation.
* libbfd.h: Regenerate.

gas/ChangeLog
2017-06-26 Kuan-Lin Chen <***@andestech.com>

* config/tc-riscv.c (md_apply_fix) [BFD_RELOC_32]: Convert to a
R_RISCV_32_PCREL relocation.

include/ChangeLog
2017-06-26 Kuan-Lin Chen <***@andestech.com>

* elf/riscv.h (R_RISCV_32_PCREL): New.
sergiodj+
2017-06-27 01:48:40 UTC
Permalink
Buildslave:
marist-fedora-s390x

Full Build URL:
<http://gdb-build.sergiodj.net/builders/Fedora-s390x-m64/builds/5643>

Commit(s) tested:
a6cbf936e3dce68114d28cdf60d510a3f78a6d40

Author(s) (in the same order as the commits):
Kuan-Lin Chen <***@andestech.com>

Subject:
RISC-V: Use pc-relative relocation for FDE initial location

Testsuite log (gdb.sum and gdb.log) URL(s):
<http://gdb-build.sergiodj.net/results/Fedora-s390x-m64/a6/a6cbf936e3dce68114d28cdf60d510a3f78a6d40/>

*** Diff to previous build ***
============================
PASS -> FAIL: gdb.base/interrupt.exp: continue
new FAIL: gdb.base/interrupt.exp: Send Control-C, second time
new FAIL: gdb.threads/interrupt-while-step-over.exp: displaced-stepping=off: iter=9: wait for stops
new FAIL: gdb.threads/interrupt-while-step-over.exp: displaced-stepping=off: iter=10: wait for stops
new FAIL: gdb.threads/interrupt-while-step-over.exp: displaced-stepping=off: iter=11: wait for stops
new FAIL: gdb.threads/interrupt-while-step-over.exp: displaced-stepping=off: iter=13: wait for stops
new FAIL: gdb.threads/interrupt-while-step-over.exp: displaced-stepping=off: iter=14: wait for stops
new FAIL: gdb.threads/interrupt-while-step-over.exp: displaced-stepping=off: iter=15: wait for stops
new FAIL: gdb.threads/interrupt-while-step-over.exp: displaced-stepping=off: iter=18: wait for stops
new FAIL: gdb.threads/interrupt-while-step-over.exp: displaced-stepping=off: iter=19: wait for stops
============================


*** Complete list of XFAILs for this builder ***

To obtain the list of XFAIL tests for this builder, go to:

<http://git.sergiodj.net/?p=gdb-xfails.git;a=blob;f=xfails/Fedora-s390x-m64/xfails/master/xfail;hb=474b075>

You can also see a pretty-printed version of the list, with more information
about each XFAIL, by going to:

<http://git.sergiodj.net/?p=gdb-xfails.git;a=blob;f=xfails/Fedora-s390x-m64/xfails/master/xfail.table;hb=474b075>
sergiodj+
2017-06-27 02:42:31 UTC
Permalink
Buildslave:
ubuntu-aarch64-1

Full Build URL:
<http://gdb-build.sergiodj.net/builders/Ubuntu-AArch64-m64/builds/2279>

Commit(s) tested:
a6cbf936e3dce68114d28cdf60d510a3f78a6d40

Author(s) (in the same order as the commits):
Kuan-Lin Chen <***@andestech.com>

Subject:
RISC-V: Use pc-relative relocation for FDE initial location

Testsuite log (gdb.sum and gdb.log) URL(s):
<http://gdb-build.sergiodj.net/results/Ubuntu-AArch64-m64/a6/a6cbf936e3dce68114d28cdf60d510a3f78a6d40/>

*** Diff to previous build ***
============================
new FAIL: gdb.threads/interrupt-while-step-over.exp: displaced-stepping=off: iter=0: wait for stops
new FAIL: gdb.threads/interrupt-while-step-over.exp: displaced-stepping=off: iter=1: wait for stops
============================


*** Complete list of XFAILs for this builder ***

To obtain the list of XFAIL tests for this builder, go to:

<http://git.sergiodj.net/?p=gdb-xfails.git;a=blob;f=xfails/Ubuntu-AArch64-m64/xfails/master/xfail;hb=abee8a4>

You can also see a pretty-printed version of the list, with more information
about each XFAIL, by going to:

<http://git.sergiodj.net/?p=gdb-xfails.git;a=blob;f=xfails/Ubuntu-AArch64-m64/xfails/master/xfail.table;hb=abee8a4>
sergiodj+
2017-06-27 03:15:41 UTC
Permalink
Buildslave:
ubuntu-aarch64-1

Full Build URL:
<http://gdb-build.sergiodj.net/builders/Ubuntu-AArch64-native-gdbserver-m64/builds/2270>

Commit(s) tested:
a6cbf936e3dce68114d28cdf60d510a3f78a6d40

Author(s) (in the same order as the commits):
Kuan-Lin Chen <***@andestech.com>

Subject:
RISC-V: Use pc-relative relocation for FDE initial location

Testsuite log (gdb.sum and gdb.log) URL(s):
<http://gdb-build.sergiodj.net/results/Ubuntu-AArch64-native-gdbserver-m64/a6/a6cbf936e3dce68114d28cdf60d510a3f78a6d40/>

*** Diff to previous build ***
============================
new FAIL: gdb.threads/interrupt-while-step-over.exp: displaced-stepping=off: iter=3: wait for stops
new FAIL: gdb.threads/interrupt-while-step-over.exp: displaced-stepping=off: iter=4: wait for stops
new FAIL: gdb.threads/interrupt-while-step-over.exp: displaced-stepping=off: iter=6: wait for stops
============================


*** Complete list of XFAILs for this builder ***

To obtain the list of XFAIL tests for this builder, go to:

<http://git.sergiodj.net/?p=gdb-xfails.git;a=blob;f=xfails/Ubuntu-AArch64-native-gdbserver-m64/xfails/master/xfail;hb=84d1683>

You can also see a pretty-printed version of the list, with more information
about each XFAIL, by going to:

<http://git.sergiodj.net/?p=gdb-xfails.git;a=blob;f=xfails/Ubuntu-AArch64-native-gdbserver-m64/xfails/master/xfail.table;hb=84d1683>
sergiodj+
2017-06-27 04:42:05 UTC
Permalink
Buildslave:
fedora-x86-64-3

Full Build URL:
<http://gdb-build.sergiodj.net/builders/Fedora-x86_64-native-extended-gdbserver-m32/builds/6480>

Commit(s) tested:
a6cbf936e3dce68114d28cdf60d510a3f78a6d40

Author(s) (in the same order as the commits):
Kuan-Lin Chen <***@andestech.com>

Subject:
RISC-V: Use pc-relative relocation for FDE initial location

Testsuite log (gdb.sum and gdb.log) URL(s):
<http://gdb-build.sergiodj.net/results/Fedora-x86_64-native-extended-gdbserver-m32/a6/a6cbf936e3dce68114d28cdf60d510a3f78a6d40/>

*** Diff to previous build ***
============================
PASS -> FAIL: gdb.base/info-os.exp: get process list
============================


*** Complete list of XFAILs for this builder ***

To obtain the list of XFAIL tests for this builder, go to:

<http://git.sergiodj.net/?p=gdb-xfails.git;a=blob;f=xfails/Fedora-x86_64-native-extended-gdbserver-m32/xfails/master/xfail;hb=53d9484>

You can also see a pretty-printed version of the list, with more information
about each XFAIL, by going to:

<http://git.sergiodj.net/?p=gdb-xfails.git;a=blob;f=xfails/Fedora-x86_64-native-extended-gdbserver-m32/xfails/master/xfail.table;hb=53d9484>
sergiodj+
2017-06-27 04:42:44 UTC
Permalink
Buildslave:
fedora-x86-64-3

Full Build URL:
<http://gdb-build.sergiodj.net/builders/Fedora-i686/builds/6509>

Commit(s) tested:
a6cbf936e3dce68114d28cdf60d510a3f78a6d40

Author(s) (in the same order as the commits):
Kuan-Lin Chen <***@andestech.com>

Subject:
RISC-V: Use pc-relative relocation for FDE initial location

Testsuite log (gdb.sum and gdb.log) URL(s):
<http://gdb-build.sergiodj.net/results/Fedora-i686/a6/a6cbf936e3dce68114d28cdf60d510a3f78a6d40/>

*** Failed to compiled GDB. ***
============================

+++ The full log is too big to be posted here.
+++ These are the last 100 lines of it.

&& rm -f $file && PATH=../src:$PATH /usr/bin/msgfmt -o $file ../../../binutils-gdb/bfd/po/sr.po
file=`echo ../../../binutils-gdb/bfd/po/sv | sed 's,.*/,,'`.gmo \
&& rm -f $file && PATH=../src:$PATH /usr/bin/msgfmt -o $file ../../../binutils-gdb/bfd/po/sv.po
file=`echo ../../../binutils-gdb/bfd/po/tr | sed 's,.*/,,'`.gmo \
&& rm -f $file && PATH=../src:$PATH /usr/bin/msgfmt -o $file ../../../binutils-gdb/bfd/po/tr.po
file=`echo ../../../binutils-gdb/bfd/po/uk | sed 's,.*/,,'`.gmo \
&& rm -f $file && PATH=../src:$PATH /usr/bin/msgfmt -o $file ../../../binutils-gdb/bfd/po/uk.po
file=`echo ../../../binutils-gdb/bfd/po/vi | sed 's,.*/,,'`.gmo \
&& rm -f $file && PATH=../src:$PATH /usr/bin/msgfmt -o $file ../../../binutils-gdb/bfd/po/vi.po
file=`echo ../../../binutils-gdb/bfd/po/zh_CN | sed 's,.*/,,'`.gmo \
&& rm -f $file && PATH=../src:$PATH /usr/bin/msgfmt -o $file ../../../binutils-gdb/bfd/po/zh_CN.po
make[4]: Leaving directory '/home/gdb-buildbot/fedora-x86-64-3/fedora-i686/build/bfd/po'
make[4]: Entering directory '/home/gdb-buildbot/fedora-x86-64-3/fedora-i686/build/bfd'
rm -f bfd-tmp.h
cp bfd-in3.h bfd-tmp.h
rm -f peigen.c
/bin/sh ../../binutils-gdb/bfd/../move-if-change bfd-tmp.h bfd.h
/usr/bin/sed -e s/XX/pe/g < ../../binutils-gdb/bfd/peXXigen.c > peigen.new
rm -f tofiles
f=""; \
for i in elf32-i386.lo elf-ifunc.lo elf-nacl.lo elf-vxworks.lo elf32.lo elf.lo elflink.lo elf-attrs.lo elf-strtab.lo elf-properties.lo elf-eh-frame.lo dwarf1.lo dwarf2.lo i386linux.lo aout32.lo pei-i386.lo peigen.lo cofflink.lo coffgen.lo elf32-gen.lo plugin.lo aout-adobe.lo aout-arm.lo aout-cris.lo aout-ns32k.lo aout-sparcle.lo aout-tic30.lo aout0.lo aout32.lo armnetbsd.lo bout.lo cf-i386lynx.lo cf-sparclynx.lo coff-apollo.lo coff-arm.lo coff-aux.lo coff-go32.lo coff-h8300.lo coff-h8500.lo coff-i386.lo coff-i860.lo coff-i960.lo coff-m68k.lo coff-m88k.lo coff-mips.lo coff-rs6000.lo coff-sh.lo coff-sparc.lo coff-stgo32.lo coff-svm68k.lo coff-tic30.lo coff-tic4x.lo coff-tic54x.lo coff-tic80.lo coff-u68k.lo coff-w65.lo coff-we32k.lo coff-z80.lo coff-z8k.lo coffgen.lo cofflink.lo dwarf1.lo dwarf2.lo ecoff.lo ecofflink.lo elf-attrs.lo elf-eh-frame.lo elf-ifunc.lo elf-m10200.lo elf-m10300.lo elf-nacl.lo elf-properties.lo elf-strtab.lo elf-vxworks.lo elf.lo elf32-am33lin.lo elf32-arc.lo elf32-arm.lo elf32-avr.lo elf32-bfin.lo elf32-cr16.lo elf32-cr16c.lo elf32-cris.lo elf32-crx.lo elf32-d10v.lo elf32-d30v.lo elf32-dlx.lo elf32-epiphany.lo elf32-fr30.lo elf32-frv.lo elf32-ft32.lo elf32-gen.lo elf32-h8300.lo elf32-hppa.lo elf32-i370.lo elf32-i386.lo elf32-i860.lo elf32-i960.lo elf32-ip2k.lo elf32-iq2000.lo elf32-lm32.lo elf32-m32c.lo elf32-m32r.lo elf32-m68hc11.lo elf32-m68hc12.lo elf32-m68hc1x.lo elf32-m68k.lo elf32-m88k.lo elf32-mcore.lo elf32-mep.lo elf32-metag.lo elf32-microblaze.lo elf32-moxie.lo elf32-msp430.lo elf32-mt.lo elf32-nds32.lo elf32-nios2.lo elf32-or1k.lo elf32-pj.lo elf32-ppc.lo elf32-pru.lo elf32-rl78.lo elf32-rx.lo elf32-s390.lo elf32-sh-symbian.lo elf32-sh.lo elf32-sh64-com.lo elf32-sh64.lo elf32-sparc.lo elf32-spu.lo elf32-tic6x.lo elf32-tilegx.lo elf32-tilepro.lo elf32-v850.lo elf32-vax.lo elf32-visium.lo elf32-wasm32.lo elf32-xc16x.lo elf32-xgate.lo elf32-xstormy16.lo elf32-xtensa.lo elf32.lo elflink.lo elfxx-sparc.lo elfxx-tilegx.lo epoc-pe-arm.lo epoc-pei-arm.lo hp300bsd.lo hp300hpux.lo i386aout.lo i386bsd.lo i386dynix.lo i386freebsd.lo i386linux.lo i386lynx.lo i386mach3.lo i386msdos.lo i386netbsd.lo i386os9k.lo ieee.lo m68k4knetbsd.lo m68klinux.lo m68knetbsd.lo m88kmach3.lo m88kopenbsd.lo mach-o.lo mach-o-i386.lo mach-o-arm.lo mipsbsd.lo newsos3.lo nlm.lo nlm32-i386.lo nlm32-ppc.lo nlm32-sparc.lo nlm32.lo ns32knetbsd.lo oasys.lo pc532-mach.lo pdp11.lo pe-arm-wince.lo pe-arm.lo pe-i386.lo pe-mcore.lo pe-mips.lo pe-ppc.lo pe-sh.lo pef.lo pei-arm-wince.lo pei-arm.lo pei-i386.lo pei-mcore.lo pei-mips.lo pei-ppc.lo pei-sh.lo peigen.lo plugin.lo ppcboot.lo reloc16.lo riscix.lo som.lo sparclinux.lo sparclynx.lo sparcnetbsd.lo sunos.lo vax1knetbsd.lo vaxbsd.lo vaxnetbsd.lo versados.lo vms-lib.lo vms-misc.lo wasm-module.lo xcofflink.lo xsym.lo xtensa-isa.lo xtensa-modules.lo cpu-i386.lo cpu-iamcu.lo cpu-plugin.lo cpu-aarch64.lo cpu-alpha.lo cpu-arc.lo cpu-arm.lo cpu-avr.lo cpu-bfin.lo cpu-cr16.lo cpu-cr16c.lo cpu-cris.lo cpu-crx.lo cpu-d10v.lo cpu-d30v.lo cpu-dlx.lo cpu-epiphany.lo cpu-fr30.lo cpu-frv.lo cpu-ft32.lo cpu-h8300.lo cpu-h8500.lo cpu-hppa.lo cpu-i370.lo cpu-i386.lo cpu-iamcu.lo cpu-l1om.lo cpu-k1om.lo cpu-i860.lo cpu-i960.lo cpu-ia64.lo cpu-ip2k.lo cpu-iq2000.lo cpu-lm32.lo cpu-m10200.lo cpu-m10300.lo cpu-m32c.lo cpu-m32r.lo cpu-m68hc11.lo cpu-m68hc12.lo cpu-m9s12x.lo cpu-m9s12xg.lo cpu-m68k.lo cpu-m88k.lo cpu-mcore.lo cpu-mep.lo cpu-metag.lo cpu-microblaze.lo cpu-mips.lo cpu-mmix.lo cpu-moxie.lo cpu-msp430.lo cpu-mt.lo cpu-nds32.lo cpu-nios2.lo cpu-ns32k.lo cpu-or1k.lo cpu-pdp11.lo cpu-pj.lo cpu-plugin.lo cpu-powerpc.lo cpu-pru.lo cpu-rs6000.lo cpu-riscv.lo cpu-rl78.lo cpu-rx.lo cpu-s390.lo cpu-score.lo cpu-sh.lo cpu-sparc.lo cpu-spu.lo cpu-tic30.lo cpu-tic4x.lo cpu-tic54x.lo cpu-tic6x.lo cpu-tic80.lo cpu-tilegx.lo cpu-tilepro.lo cpu-v850.lo cpu-v850_rh850.lo cpu-vax.lo cpu-visium.lo cpu-w65.lo cpu-wasm32.lo cpu-we32k.lo cpu-xc16x.lo cpu-xgate.lo cpu-xstormy16.lo cpu-xtensa.lo cpu-z80.lo cpu-z8k.lo trad-core.lo ; do \
case " $f " in \
*" $i "*) ;; \
*) f="$f $i" ;; \
esac ; \
done ; \
echo $f > tofiles
rm -f bfd-tmp.h
touch stmp-bfd-h
/bin/sh ./libtool --tag=CC --mode=compile gcc -DHAVE_CONFIG_H -I. -I../../binutils-gdb/bfd -DTRAD_CORE -I. -I../../binutils-gdb/bfd -I../../binutils-gdb/bfd/../include -DHAVE_all_vecs -DBINDIR='"/usr/local/bin"' -W -Wall -Wstrict-prototypes -Wmissing-prototypes -Wshadow -Wstack-usage=262144 -Werror -I../../binutils-gdb/bfd/../zlib -m32 -MT archive.lo -MD -MP -MF .deps/archive.Tpo -c -o archive.lo ../../binutils-gdb/bfd/archive.c
/bin/sh ./libtool --tag=CC --mode=compile gcc -DHAVE_CONFIG_H -I. -I../../binutils-gdb/bfd -DTRAD_CORE -I. -I../../binutils-gdb/bfd -I../../binutils-gdb/bfd/../include -DHAVE_all_vecs -DBINDIR='"/usr/local/bin"' -W -Wall -Wstrict-prototypes -Wmissing-prototypes -Wshadow -Wstack-usage=262144 -Werror -I../../binutils-gdb/bfd/../zlib -m32 -MT archures.lo -MD -MP -MF .deps/archures.Tpo -c -o archures.lo -DDEFAULT_VECTOR=i386_elf32_vec -DASSOCIATED_VECS='&i386_elf32_vec,&iamcu_elf32_vec,&i386_aout_linux_vec,&i386_pei_vec,&elf32_le_vec,&elf32_be_vec' ../../binutils-gdb/bfd/archures.c
mv -f peigen.new peigen.c
/bin/sh ./libtool --tag=CC --mode=compile gcc -DHAVE_CONFIG_H -I. -I../../binutils-gdb/bfd -DTRAD_CORE -I. -I../../binutils-gdb/bfd -I../../binutils-gdb/bfd/../include -DHAVE_all_vecs -DBINDIR='"/usr/local/bin"' -W -Wall -Wstrict-prototypes -Wmissing-prototypes -Wshadow -Wstack-usage=262144 -Werror -I../../binutils-gdb/bfd/../zlib -m32 -MT bfd.lo -MD -MP -MF .deps/bfd.Tpo -c -o bfd.lo ../../binutils-gdb/bfd/bfd.c
libtool: compile: gcc -DHAVE_CONFIG_H -I. -I../../binutils-gdb/bfd -DTRAD_CORE -I. -I../../binutils-gdb/bfd -I../../binutils-gdb/bfd/../include -DHAVE_all_vecs -DBINDIR=\"/usr/local/bin\" -W -Wall -Wstrict-prototypes -Wmissing-prototypes -Wshadow -Wstack-usage=262144 -Werror -I../../binutils-gdb/bfd/../zlib -m32 -MT archive.lo -MD -MP -MF .deps/archive.Tpo -c ../../binutils-gdb/bfd/archive.c -o archive.o
libtool: compile: gcc -DHAVE_CONFIG_H -I. -I../../binutils-gdb/bfd -DTRAD_CORE -I. -I../../binutils-gdb/bfd -I../../binutils-gdb/bfd/../include -DHAVE_all_vecs -DBINDIR=\"/usr/local/bin\" -W -Wall -Wstrict-prototypes -Wmissing-prototypes -Wshadow -Wstack-usage=262144 -Werror -I../../binutils-gdb/bfd/../zlib -m32 -MT archures.lo -MD -MP -MF .deps/archures.Tpo -c -DDEFAULT_VECTOR=i386_elf32_vec "-DASSOCIATED_VECS=&i386_elf32_vec,&iamcu_elf32_vec,&i386_aout_linux_vec,&i386_pei_vec,&elf32_le_vec,&elf32_be_vec" ../../binutils-gdb/bfd/archures.c -o archures.o
/bin/sh ../../binutils-gdb/bfd/../move-if-change tofiles ofiles
touch stamp-ofiles
/bin/sh ./libtool --tag=CC --mode=compile gcc -DHAVE_CONFIG_H -I. -I../../binutils-gdb/bfd -DTRAD_CORE -I. -I../../binutils-gdb/bfd -I../../binutils-gdb/bfd/../include -DHAVE_all_vecs -DBINDIR='"/usr/local/bin"' -W -Wall -Wstrict-prototypes -Wmissing-prototypes -Wshadow -Wstack-usage=262144 -Werror -I../../binutils-gdb/bfd/../zlib -m32 -MT bfdio.lo -MD -MP -MF .deps/bfdio.Tpo -c -o bfdio.lo ../../binutils-gdb/bfd/bfdio.c
libtool: compile: gcc -DHAVE_CONFIG_H -I. -I../../binutils-gdb/bfd -DTRAD_CORE -I. -I../../binutils-gdb/bfd -I../../binutils-gdb/bfd/../include -DHAVE_all_vecs -DBINDIR=\"/usr/local/bin\" -W -Wall -Wstrict-prototypes -Wmissing-prototypes -Wshadow -Wstack-usage=262144 -Werror -I../../binutils-gdb/bfd/../zlib -m32 -MT bfd.lo -MD -MP -MF .deps/bfd.Tpo -c ../../binutils-gdb/bfd/bfd.c -o bfd.o
libtool: compile: gcc -DHAVE_CONFIG_H -I. -I../../binutils-gdb/bfd -DTRAD_CORE -I. -I../../binutils-gdb/bfd -I../../binutils-gdb/bfd/../include -DHAVE_all_vecs -DBINDIR=\"/usr/local/bin\" -W -Wall -Wstrict-prototypes -Wmissing-prototypes -Wshadow -Wstack-usage=262144 -Werror -I../../binutils-gdb/bfd/../zlib -m32 -MT bfdio.lo -MD -MP -MF .deps/bfdio.Tpo -c ../../binutils-gdb/bfd/bfdio.c -o bfdio.o
mv -f .deps/archures.Tpo .deps/archures.Plo
/bin/sh ./libtool --tag=CC --mode=compile gcc -DHAVE_CONFIG_H -I. -I../../binutils-gdb/bfd -DTRAD_CORE -I. -I../../binutils-gdb/bfd -I../../binutils-gdb/bfd/../include -DHAVE_all_vecs -DBINDIR='"/usr/local/bin"' -W -Wall -Wstrict-prototypes -Wmissing-prototypes -Wshadow -Wstack-usage=262144 -Werror -I../../binutils-gdb/bfd/../zlib -m32 -MT bfdwin.lo -MD -MP -MF .deps/bfdwin.Tpo -c -o bfdwin.lo ../../binutils-gdb/bfd/bfdwin.c
libtool: compile: gcc -DHAVE_CONFIG_H -I. -I../../binutils-gdb/bfd -DTRAD_CORE -I. -I../../binutils-gdb/bfd -I../../binutils-gdb/bfd/../include -DHAVE_all_vecs -DBINDIR=\"/usr/local/bin\" -W -Wall -Wstrict-prototypes -Wmissing-prototypes -Wshadow -Wstack-usage=262144 -Werror -I../../binutils-gdb/bfd/../zlib -m32 -MT bfdwin.lo -MD -MP -MF .deps/bfdwin.Tpo -c ../../binutils-gdb/bfd/bfdwin.c -o bfdwin.o
mv -f .deps/bfdio.Tpo .deps/bfdio.Plo
/bin/sh ./libtool --tag=CC --mode=compile gcc -DHAVE_CONFIG_H -I. -I../../binutils-gdb/bfd -DTRAD_CORE -I. -I../../binutils-gdb/bfd -I../../binutils-gdb/bfd/../include -DHAVE_all_vecs -DBINDIR='"/usr/local/bin"' -W -Wall -Wstrict-prototypes -Wmissing-prototypes -Wshadow -Wstack-usage=262144 -Werror -I../../binutils-gdb/bfd/../zlib -m32 -MT cache.lo -MD -MP -MF .deps/cache.Tpo -c -o cache.lo ../../binutils-gdb/bfd/cache.c
libtool: compile: gcc -DHAVE_CONFIG_H -I. -I../../binutils-gdb/bfd -DTRAD_CORE -I. -I../../binutils-gdb/bfd -I../../binutils-gdb/bfd/../include -DHAVE_all_vecs -DBINDIR=\"/usr/local/bin\" -W -Wall -Wstrict-prototypes -Wmissing-prototypes -Wshadow -Wstack-usage=262144 -Werror -I../../binutils-gdb/bfd/../zlib -m32 -MT cache.lo -MD -MP -MF .deps/cache.Tpo -c ../../binutils-gdb/bfd/cache.c -o cache.o
mv -f .deps/bfdwin.Tpo .deps/bfdwin.Plo
/bin/sh ./libtool --tag=CC --mode=compile gcc -DHAVE_CONFIG_H -I. -I../../binutils-gdb/bfd -DTRAD_CORE -I. -I../../binutils-gdb/bfd -I../../binutils-gdb/bfd/../include -DHAVE_all_vecs -DBINDIR='"/usr/local/bin"' -W -Wall -Wstrict-prototypes -Wmissing-prototypes -Wshadow -Wstack-usage=262144 -Werror -I../../binutils-gdb/bfd/../zlib -m32 -MT coff-bfd.lo -MD -MP -MF .deps/coff-bfd.Tpo -c -o coff-bfd.lo ../../binutils-gdb/bfd/coff-bfd.c
mv -f .deps/cache.Tpo .deps/cache.Plo
/bin/sh ./libtool --tag=CC --mode=compile gcc -DHAVE_CONFIG_H -I. -I../../binutils-gdb/bfd -DTRAD_CORE -I. -I../../binutils-gdb/bfd -I../../binutils-gdb/bfd/../include -DHAVE_all_vecs -DBINDIR='"/usr/local/bin"' -W -Wall -Wstrict-prototypes -Wmissing-prototypes -Wshadow -Wstack-usage=262144 -Werror -I../../binutils-gdb/bfd/../zlib -m32 -MT compress.lo -MD -MP -MF .deps/compress.Tpo -c -o compress.lo ../../binutils-gdb/bfd/compress.c
mv -f .deps/bfd.Tpo .deps/bfd.Plo
/bin/sh ./libtool --tag=CC --mode=compile gcc -DHAVE_CONFIG_H -I. -I../../binutils-gdb/bfd -DTRAD_CORE -I. -I../../binutils-gdb/bfd -I../../binutils-gdb/bfd/../include -DHAVE_all_vecs -DBINDIR='"/usr/local/bin"' -W -Wall -Wstrict-prototypes -Wmissing-prototypes -Wshadow -Wstack-usage=262144 -Werror -I../../binutils-gdb/bfd/../zlib -m32 -MT corefile.lo -MD -MP -MF .deps/corefile.Tpo -c -o corefile.lo ../../binutils-gdb/bfd/corefile.c
libtool: compile: gcc -DHAVE_CONFIG_H -I. -I../../binutils-gdb/bfd -DTRAD_CORE -I. -I../../binutils-gdb/bfd -I../../binutils-gdb/bfd/../include -DHAVE_all_vecs -DBINDIR=\"/usr/local/bin\" -W -Wall -Wstrict-prototypes -Wmissing-prototypes -Wshadow -Wstack-usage=262144 -Werror -I../../binutils-gdb/bfd/../zlib -m32 -MT coff-bfd.lo -MD -MP -MF .deps/coff-bfd.Tpo -c ../../binutils-gdb/bfd/coff-bfd.c -o coff-bfd.o
mv -f .deps/archive.Tpo .deps/archive.Plo
/bin/sh ./libtool --tag=CC --mode=compile gcc -DHAVE_CONFIG_H -I. -I../../binutils-gdb/bfd -DTRAD_CORE -I. -I../../binutils-gdb/bfd -I../../binutils-gdb/bfd/../include -DHAVE_all_vecs -DBINDIR='"/usr/local/bin"' -W -Wall -Wstrict-prototypes -Wmissing-prototypes -Wshadow -Wstack-usage=262144 -Werror -I../../binutils-gdb/bfd/../zlib -m32 -MT format.lo -MD -MP -MF .deps/format.Tpo -c -o format.lo ../../binutils-gdb/bfd/format.c
libtool: compile: gcc -DHAVE_CONFIG_H -I. -I../../binutils-gdb/bfd -DTRAD_CORE -I. -I../../binutils-gdb/bfd -I../../binutils-gdb/bfd/../include -DHAVE_all_vecs -DBINDIR=\"/usr/local/bin\" -W -Wall -Wstrict-prototypes -Wmissing-prototypes -Wshadow -Wstack-usage=262144 -Werror -I../../binutils-gdb/bfd/../zlib -m32 -MT compress.lo -MD -MP -MF .deps/compress.Tpo -c ../../binutils-gdb/bfd/compress.c -o compress.o
libtool: compile: gcc -DHAVE_CONFIG_H -I. -I../../binutils-gdb/bfd -DTRAD_CORE -I. -I../../binutils-gdb/bfd -I../../binutils-gdb/bfd/../include -DHAVE_all_vecs -DBINDIR=\"/usr/local/bin\" -W -Wall -Wstrict-prototypes -Wmissing-prototypes -Wshadow -Wstack-usage=262144 -Werror -I../../binutils-gdb/bfd/../zlib -m32 -MT corefile.lo -MD -MP -MF .deps/corefile.Tpo -c ../../binutils-gdb/bfd/corefile.c -o corefile.o
mv -f .deps/coff-bfd.Tpo .deps/coff-bfd.Plo
/bin/sh ./libtool --tag=CC --mode=compile gcc -DHAVE_CONFIG_H -I. -I../../binutils-gdb/bfd -DTRAD_CORE -I. -I../../binutils-gdb/bfd -I../../binutils-gdb/bfd/../include -DHAVE_all_vecs -DBINDIR='"/usr/local/bin"' -W -Wall -Wstrict-prototypes -Wmissing-prototypes -Wshadow -Wstack-usage=262144 -Werror -I../../binutils-gdb/bfd/../zlib -m32 -MT hash.lo -MD -MP -MF .deps/hash.Tpo -c -o hash.lo ../../binutils-gdb/bfd/hash.c
libtool: compile: gcc -DHAVE_CONFIG_H -I. -I../../binutils-gdb/bfd -DTRAD_CORE -I. -I../../binutils-gdb/bfd -I../../binutils-gdb/bfd/../include -DHAVE_all_vecs -DBINDIR=\"/usr/local/bin\" -W -Wall -Wstrict-prototypes -Wmissing-prototypes -Wshadow -Wstack-usage=262144 -Werror -I../../binutils-gdb/bfd/../zlib -m32 -MT format.lo -MD -MP -MF .deps/format.Tpo -c ../../binutils-gdb/bfd/format.c -o format.o
mv -f .deps/corefile.Tpo .deps/corefile.Plo
/bin/sh ./libtool --tag=CC --mode=compile gcc -DHAVE_CONFIG_H -I. -I../../binutils-gdb/bfd -DTRAD_CORE -I. -I../../binutils-gdb/bfd -I../../binutils-gdb/bfd/../include -DHAVE_all_vecs -DBINDIR='"/usr/local/bin"' -W -Wall -Wstrict-prototypes -Wmissing-prototypes -Wshadow -Wstack-usage=262144 -Werror -I../../binutils-gdb/bfd/../zlib -m32 -MT init.lo -MD -MP -MF .deps/init.Tpo -c -o init.lo ../../binutils-gdb/bfd/init.c
libtool: compile: gcc -DHAVE_CONFIG_H -I. -I../../binutils-gdb/bfd -DTRAD_CORE -I. -I../../binutils-gdb/bfd -I../../binutils-gdb/bfd/../include -DHAVE_all_vecs -DBINDIR=\"/usr/local/bin\" -W -Wall -Wstrict-prototypes -Wmissing-prototypes -Wshadow -Wstack-usage=262144 -Werror -I../../binutils-gdb/bfd/../zlib -m32 -MT init.lo -MD -MP -MF .deps/init.Tpo -c ../../binutils-gdb/bfd/init.c -o init.o
mv -f .deps/compress.Tpo .deps/compress.Plo
/bin/sh ./libtool --tag=CC --mode=compile gcc -DHAVE_CONFIG_H -I. -I../../binutils-gdb/bfd -DTRAD_CORE -I. -I../../binutils-gdb/bfd -I../../binutils-gdb/bfd/../include -DHAVE_all_vecs -DBINDIR='"/usr/local/bin"' -W -Wall -Wstrict-prototypes -Wmissing-prototypes -Wshadow -Wstack-usage=262144 -Werror -I../../binutils-gdb/bfd/../zlib -m32 -MT libbfd.lo -MD -MP -MF .deps/libbfd.Tpo -c -o libbfd.lo ../../binutils-gdb/bfd/libbfd.c
libtool: compile: gcc -DHAVE_CONFIG_H -I. -I../../binutils-gdb/bfd -DTRAD_CORE -I. -I../../binutils-gdb/bfd -I../../binutils-gdb/bfd/../include -DHAVE_all_vecs -DBINDIR=\"/usr/local/bin\" -W -Wall -Wstrict-prototypes -Wmissing-prototypes -Wshadow -Wstack-usage=262144 -Werror -I../../binutils-gdb/bfd/../zlib -m32 -MT hash.lo -MD -MP -MF .deps/hash.Tpo -c ../../binutils-gdb/bfd/hash.c -o hash.o
mv -f .deps/format.Tpo .deps/format.Plo
/bin/sh ./libtool --tag=CC --mode=compile gcc -DHAVE_CONFIG_H -I. -I../../binutils-gdb/bfd -DTRAD_CORE -I. -I../../binutils-gdb/bfd -I../../binutils-gdb/bfd/../include -DHAVE_all_vecs -DBINDIR='"/usr/local/bin"' -W -Wall -Wstrict-prototypes -Wmissing-prototypes -Wshadow -Wstack-usage=262144 -Werror -I../../binutils-gdb/bfd/../zlib -m32 -MT linker.lo -MD -MP -MF .deps/linker.Tpo -c -o linker.lo ../../binutils-gdb/bfd/linker.c
libtool: compile: gcc -DHAVE_CONFIG_H -I. -I../../binutils-gdb/bfd -DTRAD_CORE -I. -I../../binutils-gdb/bfd -I../../binutils-gdb/bfd/../include -DHAVE_all_vecs -DBINDIR=\"/usr/local/bin\" -W -Wall -Wstrict-prototypes -Wmissing-prototypes -Wshadow -Wstack-usage=262144 -Werror -I../../binutils-gdb/bfd/../zlib -m32 -MT libbfd.lo -MD -MP -MF .deps/libbfd.Tpo -c ../../binutils-gdb/bfd/libbfd.c -o libbfd.o
mv -f .deps/init.Tpo .deps/init.Plo
/bin/sh ./libtool --tag=CC --mode=compile gcc -DHAVE_CONFIG_H -I. -I../../binutils-gdb/bfd -DTRAD_CORE -I. -I../../binutils-gdb/bfd -I../../binutils-gdb/bfd/../include -DHAVE_all_vecs -DBINDIR='"/usr/local/bin"' -W -Wall -Wstrict-prototypes -Wmissing-prototypes -Wshadow -Wstack-usage=262144 -Werror -I../../binutils-gdb/bfd/../zlib -m32 -MT merge.lo -MD -MP -MF .deps/merge.Tpo -c -o merge.lo ../../binutils-gdb/bfd/merge.c
libtool: compile: gcc -DHAVE_CONFIG_H -I. -I../../binutils-gdb/bfd -DTRAD_CORE -I. -I../../binutils-gdb/bfd -I../../binutils-gdb/bfd/../include -DHAVE_all_vecs -DBINDIR=\"/usr/local/bin\" -W -Wall -Wstrict-prototypes -Wmissing-prototypes -Wshadow -Wstack-usage=262144 -Werror -I../../binutils-gdb/bfd/../zlib -m32 -MT merge.lo -MD -MP -MF .deps/merge.Tpo -c ../../binutils-gdb/bfd/merge.c -o merge.o
../../binutils-gdb/bfd/libbfd.c: In function _bfd_generic_get_section_contents:
../../binutils-gdb/bfd/libbfd.c:818:44: error: comparison between signed and unsigned integer expressions [-Werror=sign-compare]
|| section->filepos + offset + count > filesz)
^
libtool: compile: gcc -DHAVE_CONFIG_H -I. -I../../binutils-gdb/bfd -DTRAD_CORE -I. -I../../binutils-gdb/bfd -I../../binutils-gdb/bfd/../include -DHAVE_all_vecs -DBINDIR=\"/usr/local/bin\" -W -Wall -Wstrict-prototypes -Wmissing-prototypes -Wshadow -Wstack-usage=262144 -Werror -I../../binutils-gdb/bfd/../zlib -m32 -MT linker.lo -MD -MP -MF .deps/linker.Tpo -c ../../binutils-gdb/bfd/linker.c -o linker.o
mv -f .deps/hash.Tpo .deps/hash.Plo
/bin/sh ./libtool --tag=CC --mode=compile gcc -DHAVE_CONFIG_H -I. -I../../binutils-gdb/bfd -DTRAD_CORE -I. -I../../binutils-gdb/bfd -I../../binutils-gdb/bfd/../include -DHAVE_all_vecs -DBINDIR='"/usr/local/bin"' -W -Wall -Wstrict-prototypes -Wmissing-prototypes -Wshadow -Wstack-usage=262144 -Werror -I../../binutils-gdb/bfd/../zlib -m32 -MT opncls.lo -MD -MP -MF .deps/opncls.Tpo -c -o opncls.lo ../../binutils-gdb/bfd/opncls.c
libtool: compile: gcc -DHAVE_CONFIG_H -I. -I../../binutils-gdb/bfd -DTRAD_CORE -I. -I../../binutils-gdb/bfd -I../../binutils-gdb/bfd/../include -DHAVE_all_vecs -DBINDIR=\"/usr/local/bin\" -W -Wall -Wstrict-prototypes -Wmissing-prototypes -Wshadow -Wstack-usage=262144 -Werror -I../../binutils-gdb/bfd/../zlib -m32 -MT opncls.lo -MD -MP -MF .deps/opncls.Tpo -c ../../binutils-gdb/bfd/opncls.c -o opncls.o
cc1: all warnings being treated as errors
Makefile:1700: recipe for target 'libbfd.lo' failed
make[4]: *** [libbfd.lo] Error 1
make[4]: *** Waiting for unfinished jobs....
mv -f .deps/merge.Tpo .deps/merge.Plo
mv -f .deps/opncls.Tpo .deps/opncls.Plo
mv -f .deps/linker.Tpo .deps/linker.Plo
make[4]: Leaving directory '/home/gdb-buildbot/fedora-x86-64-3/fedora-i686/build/bfd'
Makefile:1743: recipe for target 'all-recursive' failed
make[3]: Leaving directory '/home/gdb-buildbot/fedora-x86-64-3/fedora-i686/build/bfd'
make[3]: *** [all-recursive] Error 1
Makefile:1209: recipe for target 'all' failed
make[2]: Leaving directory '/home/gdb-buildbot/fedora-x86-64-3/fedora-i686/build/bfd'
make[2]: *** [all] Error 2
Makefile:2689: recipe for target 'all-bfd' failed
make[1]: *** [all-bfd] Error 2
make[1]: Leaving directory '/home/gdb-buildbot/fedora-x86-64-3/fedora-i686/build'
Makefile:849: recipe for target 'all' failed
make: *** [all] Error 2
============================
sergiodj+
2017-06-27 07:27:13 UTC
Permalink
Buildslave:
ubuntu-trusty-aarch32-1

Full Build URL:
<http://gdb-build.sergiodj.net/builders/Ubuntu-AArch32-native-gdbserver-m32/builds/895>

Commit(s) tested:
a6cbf936e3dce68114d28cdf60d510a3f78a6d40

Author(s) (in the same order as the commits):
Kuan-Lin Chen <***@andestech.com>

Subject:
RISC-V: Use pc-relative relocation for FDE initial location

Testsuite log (gdb.sum and gdb.log) URL(s):
<http://gdb-build.sergiodj.net/results/Ubuntu-AArch32-native-gdbserver-m32/a6/a6cbf936e3dce68114d28cdf60d510a3f78a6d40/>

*** Diff to previous build ***
============================
new FAIL: gdb.threads/interrupt-while-step-over.exp: displaced-stepping=off: iter=15: wait for stops
============================


*** Complete list of XFAILs for this builder ***

FAILURE TO OBTAIN THE COMMIT FOR THE XFAIL LIST. PLEASE CONTACT THE BUILDBOT ADMIN.
sergiodj+
2017-06-27 08:29:35 UTC
Permalink
Buildslave:
ubuntu-trusty-aarch32-1

Full Build URL:
<http://gdb-build.sergiodj.net/builders/Ubuntu-AArch32-native-extended-gdbserver-m32/builds/905>

Commit(s) tested:
a6cbf936e3dce68114d28cdf60d510a3f78a6d40

Author(s) (in the same order as the commits):
Kuan-Lin Chen <***@andestech.com>

Subject:
RISC-V: Use pc-relative relocation for FDE initial location

Testsuite log (gdb.sum and gdb.log) URL(s):
<http://gdb-build.sergiodj.net/results/Ubuntu-AArch32-native-extended-gdbserver-m32/a6/a6cbf936e3dce68114d28cdf60d510a3f78a6d40/>

*** Diff to previous build ***
============================
PASS -> FAIL: gdb.base/longjmp.exp: next over patt3
new FAIL: gdb.threads/interrupt-while-step-over.exp: displaced-stepping=off: iter=3: wait for stops
new FAIL: gdb.threads/interrupt-while-step-over.exp: displaced-stepping=off: iter=7: wait for stops
new FAIL: gdb.threads/interrupt-while-step-over.exp: displaced-stepping=off: iter=11: wait for stops
new FAIL: gdb.threads/interrupt-while-step-over.exp: displaced-stepping=off: iter=15: wait for stops
new FAIL: gdb.threads/interrupt-while-step-over.exp: displaced-stepping=off: iter=18: wait for stops
new FAIL: gdb.threads/queue-signal.exp: determine thread functions
new FAIL: gdb.threads/schedlock.exp: schedlock=off: cmd=next: call_function=0: find current thread
new FAIL: gdb.threads/schedlock.exp: schedlock=off: cmd=next: call_function=0: listed args
new FAIL: gdb.threads/schedlock.exp: schedlock=off: cmd=next: call_function=0: next to increment
PASS -> FAIL: gdb.threads/schedlock.exp: schedlock=off: cmd=next: call_function=0: next does not change thread
new FAIL: gdb.threads/schedlock.exp: schedlock=off: cmd=next: call_function=0: current thread advanced - unlocked
new FAIL: gdb.threads/schedlock.exp: schedlock=off: cmd=next: call_function=1: set scheduler-locking off
new FAIL: gdb.threads/schedlock.exp: schedlock=off: cmd=next: call_function=1: continue to breakpoint: return to loop
new FAIL: gdb.threads/schedlock.exp: schedlock=off: cmd=next: call_function=1: delete all breakpoints in delete_breakpoints
new FAIL: gdb.threads/schedlock.exp: schedlock=off: cmd=next: call_function=1: print call_function = 1
new FAIL: gdb.threads/schedlock.exp: schedlock=off: cmd=next: call_function=1: listed args
new FAIL: gdb.threads/schedlock.exp: schedlock=off: cmd=next: call_function=1: next to increment
new FAIL: gdb.threads/schedlock.exp: schedlock=off: cmd=next: call_function=1: find current thread
new FAIL: gdb.threads/schedlock.exp: schedlock=step: cmd=step: set scheduler-locking off
new FAIL: gdb.threads/schedlock.exp: schedlock=step: cmd=step: continue to breakpoint: return to loop
new FAIL: gdb.threads/schedlock.exp: schedlock=step: cmd=step: delete all breakpoints in delete_breakpoints
new FAIL: gdb.threads/schedlock.exp: schedlock=step: cmd=step: set scheduler-locking step
new FAIL: gdb.threads/schedlock.exp: schedlock=step: cmd=step: print call_function = 0
new FAIL: gdb.threads/schedlock.exp: schedlock=step: cmd=step: listed args
new FAIL: gdb.threads/schedlock.exp: schedlock=step: cmd=step: step to increment
new FAIL: gdb.threads/schedlock.exp: schedlock=step: cmd=step: find current thread
new FAIL: gdb.threads/schedlock.exp: schedlock=step: cmd=next: call_function=0: set scheduler-locking off
new FAIL: gdb.threads/schedlock.exp: schedlock=step: cmd=next: call_function=0: continue to breakpoint: return to loop
new FAIL: gdb.threads/schedlock.exp: schedlock=step: cmd=next: call_function=0: delete all breakpoints in delete_breakpoints
new FAIL: gdb.threads/schedlock.exp: schedlock=step: cmd=next: call_function=0: set scheduler-locking step
new FAIL: gdb.threads/schedlock.exp: schedlock=step: cmd=next: call_function=0: print call_function = 0
new FAIL: gdb.threads/schedlock.exp: schedlock=step: cmd=next: call_function=0: listed args
new FAIL: gdb.threads/schedlock.exp: schedlock=step: cmd=next: call_function=0: next to increment
new FAIL: gdb.threads/schedlock.exp: schedlock=step: cmd=next: call_function=0: find current thread
new FAIL: gdb.threads/schedlock.exp: schedlock=step: cmd=next: call_function=1: set scheduler-locking off
new FAIL: gdb.threads/schedlock.exp: schedlock=step: cmd=next: call_function=1: continue to breakpoint: return to loop
new FAIL: gdb.threads/schedlock.exp: schedlock=step: cmd=next: call_function=1: delete all breakpoints in delete_breakpoints
new FAIL: gdb.threads/schedlock.exp: schedlock=step: cmd=next: call_function=1: set scheduler-locking step
new FAIL: gdb.threads/schedlock.exp: schedlock=step: cmd=next: call_function=1: print call_function = 1
new FAIL: gdb.threads/schedlock.exp: schedlock=step: cmd=next: call_function=1: listed args
new FAIL: gdb.threads/schedlock.exp: schedlock=step: cmd=next: call_function=1: next to increment
new FAIL: gdb.threads/schedlock.exp: schedlock=step: cmd=next: call_function=1: find current thread
new FAIL: gdb.threads/schedlock.exp: schedlock=on: cmd=step: set scheduler-locking off
new FAIL: gdb.threads/schedlock.exp: schedlock=on: cmd=step: continue to breakpoint: return to loop
new FAIL: gdb.threads/schedlock.exp: schedlock=on: cmd=step: delete all breakpoints in delete_breakpoints
new FAIL: gdb.threads/schedlock.exp: schedlock=on: cmd=step: set scheduler-locking on
new FAIL: gdb.threads/schedlock.exp: schedlock=on: cmd=step: print call_function = 0
new FAIL: gdb.threads/schedlock.exp: schedlock=on: cmd=step: listed args
new FAIL: gdb.threads/schedlock.exp: schedlock=on: cmd=step: step to increment
new FAIL: gdb.threads/schedlock.exp: schedlock=on: cmd=step: find current thread
new FAIL: gdb.threads/schedlock.exp: schedlock=on: cmd=next: call_function=0: set scheduler-locking off
new FAIL: gdb.threads/schedlock.exp: schedlock=on: cmd=next: call_function=0: continue to breakpoint: return to loop
new FAIL: gdb.threads/schedlock.exp: schedlock=on: cmd=next: call_function=0: delete all breakpoints in delete_breakpoints
new FAIL: gdb.threads/schedlock.exp: schedlock=on: cmd=next: call_function=0: set scheduler-locking on
new FAIL: gdb.threads/schedlock.exp: schedlock=on: cmd=next: call_function=0: print call_function = 0
new FAIL: gdb.threads/schedlock.exp: schedlock=on: cmd=next: call_function=0: listed args
new FAIL: gdb.threads/schedlock.exp: schedlock=on: cmd=next: call_function=0: next to increment
new FAIL: gdb.threads/schedlock.exp: schedlock=on: cmd=next: call_function=0: find current thread
new FAIL: gdb.threads/schedlock.exp: schedlock=on: cmd=next: call_function=1: set scheduler-locking off
new FAIL: gdb.threads/schedlock.exp: schedlock=on: cmd=next: call_function=1: continue to breakpoint: return to loop
new FAIL: gdb.threads/schedlock.exp: schedlock=on: cmd=next: call_function=1: delete all breakpoints in delete_breakpoints
new FAIL: gdb.threads/schedlock.exp: schedlock=on: cmd=next: call_function=1: set scheduler-locking on
new FAIL: gdb.threads/schedlock.exp: schedlock=on: cmd=next: call_function=1: print call_function = 1
new FAIL: gdb.threads/schedlock.exp: schedlock=on: cmd=next: call_function=1: listed args
new FAIL: gdb.threads/schedlock.exp: schedlock=on: cmd=next: call_function=1: next to increment
new FAIL: gdb.threads/schedlock.exp: schedlock=on: cmd=next: call_function=1: find current thread
============================


*** Complete list of XFAILs for this builder ***

FAILURE TO OBTAIN THE COMMIT FOR THE XFAIL LIST. PLEASE CONTACT THE BUILDBOT ADMIN.
sergiodj+
2017-06-27 09:06:18 UTC
Permalink
Buildslave:
ubuntu-trusty-aarch32-1

Full Build URL:
<http://gdb-build.sergiodj.net/builders/Ubuntu-AArch32-m32/builds/904>

Commit(s) tested:
a6cbf936e3dce68114d28cdf60d510a3f78a6d40

Author(s) (in the same order as the commits):
Kuan-Lin Chen <***@andestech.com>

Subject:
RISC-V: Use pc-relative relocation for FDE initial location

Testsuite log (gdb.sum and gdb.log) URL(s):
<http://gdb-build.sergiodj.net/results/Ubuntu-AArch32-m32/a6/a6cbf936e3dce68114d28cdf60d510a3f78a6d40/>

*** Diff to previous build ***
============================
new FAIL: gdb.threads/interrupt-while-step-over.exp: displaced-stepping=off: iter=6: wait for stops
new FAIL: gdb.threads/interrupt-while-step-over.exp: displaced-stepping=off: iter=9: wait for stops
new FAIL: gdb.threads/interrupt-while-step-over.exp: displaced-stepping=off: iter=18: wait for stops
PASS -> FAIL: gdb.threads/schedlock.exp: schedlock=off: cmd=next: call_function=0: next does not change thread
PASS -> FAIL: gdb.threads/schedlock.exp: schedlock=off: cmd=next: call_function=0: current thread advanced - unlocked
new FAIL: gdb.threads/schedlock.exp: schedlock=off: cmd=next: call_function=1: setting breakpoint at 80 if arg != 0
PASS -> FAIL: gdb.threads/schedlock.exp: schedlock=off: cmd=next: call_function=1: other threads ran - unlocked
new FAIL: gdb.threads/schedlock.exp: schedlock=step: cmd=step: setting breakpoint at 80 if arg != 0
new FAIL: gdb.threads/schedlock.exp: schedlock=step: cmd=next: call_function=0: setting breakpoint at 80 if arg != 0
new FAIL: gdb.threads/schedlock.exp: schedlock=step: cmd=next: call_function=1: setting breakpoint at 80 if arg != 0
new FAIL: gdb.threads/schedlock.exp: schedlock=on: cmd=step: setting breakpoint at 80 if arg != 0
new FAIL: gdb.threads/schedlock.exp: schedlock=on: cmd=next: call_function=0: setting breakpoint at 80 if arg != 0
new FAIL: gdb.threads/schedlock.exp: schedlock=on: cmd=next: call_function=1: setting breakpoint at 80 if arg != 0
============================


*** Complete list of XFAILs for this builder ***

FAILURE TO OBTAIN THE COMMIT FOR THE XFAIL LIST. PLEASE CONTACT THE BUILDBOT ADMIN.
sergiodj+
2017-06-27 09:30:20 UTC
Permalink
Buildslave:
ubuntu-aarch64-1

Full Build URL:
<http://gdb-build.sergiodj.net/builders/Ubuntu-AArch64-m64/builds/2281>

Commit(s) tested:
db665f427ca781d631d9e29b1bb744fb11ffcbba

Author(s) (in the same order as the commits):
Simon Marchi <***@ericsson.com>

Subject:
darwin: Do not add a dummy thread

Testsuite log (gdb.sum and gdb.log) URL(s):
<http://gdb-build.sergiodj.net/results/Ubuntu-AArch64-m64/db/db665f427ca781d631d9e29b1bb744fb11ffcbba/>

*** Diff to previous build ***
============================
new FAIL: gdb.threads/interrupt-while-step-over.exp: displaced-stepping=off: iter=3: wait for stops
============================


*** Complete list of XFAILs for this builder ***

To obtain the list of XFAIL tests for this builder, go to:

<http://git.sergiodj.net/?p=gdb-xfails.git;a=blob;f=xfails/Ubuntu-AArch64-m64/xfails/master/xfail;hb=abee8a4>

You can also see a pretty-printed version of the list, with more information
about each XFAIL, by going to:

<http://git.sergiodj.net/?p=gdb-xfails.git;a=blob;f=xfails/Ubuntu-AArch64-m64/xfails/master/xfail.table;hb=abee8a4>
sergiodj+
2017-06-27 09:47:47 UTC
Permalink
Buildslave:
marist-fedora-s390x

Full Build URL:
<http://gdb-build.sergiodj.net/builders/Fedora-s390x-m64/builds/5645>

Commit(s) tested:
db665f427ca781d631d9e29b1bb744fb11ffcbba

Author(s) (in the same order as the commits):
Simon Marchi <***@ericsson.com>

Subject:
darwin: Do not add a dummy thread

Testsuite log (gdb.sum and gdb.log) URL(s):
<http://gdb-build.sergiodj.net/results/Fedora-s390x-m64/db/db665f427ca781d631d9e29b1bb744fb11ffcbba/>

*** Diff to previous build ***
============================
new FAIL: gdb.threads/interrupt-while-step-over.exp: displaced-stepping=off: iter=0: wait for stops
new FAIL: gdb.threads/interrupt-while-step-over.exp: displaced-stepping=off: iter=1: wait for stops
new FAIL: gdb.threads/interrupt-while-step-over.exp: displaced-stepping=off: iter=3: wait for stops
new FAIL: gdb.threads/interrupt-while-step-over.exp: displaced-stepping=off: iter=4: wait for stops
new FAIL: gdb.threads/interrupt-while-step-over.exp: displaced-stepping=off: iter=5: wait for stops
new FAIL: gdb.threads/interrupt-while-step-over.exp: displaced-stepping=off: iter=8: wait for stops
============================


*** Complete list of XFAILs for this builder ***

To obtain the list of XFAIL tests for this builder, go to:

<http://git.sergiodj.net/?p=gdb-xfails.git;a=blob;f=xfails/Fedora-s390x-m64/xfails/master/xfail;hb=474b075>

You can also see a pretty-printed version of the list, with more information
about each XFAIL, by going to:

<http://git.sergiodj.net/?p=gdb-xfails.git;a=blob;f=xfails/Fedora-s390x-m64/xfails/master/xfail.table;hb=474b075>
sergiodj+
2017-06-27 10:03:39 UTC
Permalink
Buildslave:
ubuntu-aarch64-1

Full Build URL:
<http://gdb-build.sergiodj.net/builders/Ubuntu-AArch64-native-gdbserver-m64/builds/2272>

Commit(s) tested:
db665f427ca781d631d9e29b1bb744fb11ffcbba

Author(s) (in the same order as the commits):
Simon Marchi <***@ericsson.com>

Subject:
darwin: Do not add a dummy thread

Testsuite log (gdb.sum and gdb.log) URL(s):
<http://gdb-build.sergiodj.net/results/Ubuntu-AArch64-native-gdbserver-m64/db/db665f427ca781d631d9e29b1bb744fb11ffcbba/>

*** Diff to previous build ***
============================
new FAIL: gdb.threads/interrupt-while-step-over.exp: displaced-stepping=off: iter=0: wait for stops
============================


*** Complete list of XFAILs for this builder ***

To obtain the list of XFAIL tests for this builder, go to:

<http://git.sergiodj.net/?p=gdb-xfails.git;a=blob;f=xfails/Ubuntu-AArch64-native-gdbserver-m64/xfails/master/xfail;hb=84d1683>

You can also see a pretty-printed version of the list, with more information
about each XFAIL, by going to:

<http://git.sergiodj.net/?p=gdb-xfails.git;a=blob;f=xfails/Ubuntu-AArch64-native-gdbserver-m64/xfails/master/xfail.table;hb=84d1683>
sergiodj+
2017-06-27 10:38:19 UTC
Permalink
Buildslave:
ubuntu-trusty-aarch32-1

Full Build URL:
<http://gdb-build.sergiodj.net/builders/Ubuntu-AArch32-native-gdbserver-m32/builds/897>

Commit(s) tested:
db665f427ca781d631d9e29b1bb744fb11ffcbba

Author(s) (in the same order as the commits):
Simon Marchi <***@ericsson.com>

Subject:
darwin: Do not add a dummy thread

Testsuite log (gdb.sum and gdb.log) URL(s):
<http://gdb-build.sergiodj.net/results/Ubuntu-AArch32-native-gdbserver-m32/db/db665f427ca781d631d9e29b1bb744fb11ffcbba/>

*** Diff to previous build ***
============================
new FAIL: gdb.threads/interrupt-while-step-over.exp: displaced-stepping=off: iter=3: wait for stops
new FAIL: gdb.threads/interrupt-while-step-over.exp: displaced-stepping=off: iter=14: wait for stops
new FAIL: gdb.threads/interrupt-while-step-over.exp: displaced-stepping=off: iter=18: wait for stops
============================


*** Complete list of XFAILs for this builder ***

FAILURE TO OBTAIN THE COMMIT FOR THE XFAIL LIST. PLEASE CONTACT THE BUILDBOT ADMIN.
sergiodj+
2017-06-27 11:01:20 UTC
Permalink
Buildslave:
ubuntu-trusty-aarch32-1

Full Build URL:
<http://gdb-build.sergiodj.net/builders/Ubuntu-AArch32-native-extended-gdbserver-m32/builds/907>

Commit(s) tested:
db665f427ca781d631d9e29b1bb744fb11ffcbba

Author(s) (in the same order as the commits):
Simon Marchi <***@ericsson.com>

Subject:
darwin: Do not add a dummy thread

Testsuite log (gdb.sum and gdb.log) URL(s):
<http://gdb-build.sergiodj.net/results/Ubuntu-AArch32-native-extended-gdbserver-m32/db/db665f427ca781d631d9e29b1bb744fb11ffcbba/>

*** Diff to previous build ***
============================
PASS -> FAIL: gdb.base/longjmp.exp: next over patt3
new FAIL: gdb.threads/interrupt-while-step-over.exp: displaced-stepping=off: iter=3: wait for stops
new FAIL: gdb.threads/interrupt-while-step-over.exp: displaced-stepping=off: iter=6: wait for stops
new FAIL: gdb.threads/interrupt-while-step-over.exp: displaced-stepping=off: iter=11: wait for stops
============================


*** Complete list of XFAILs for this builder ***

FAILURE TO OBTAIN THE COMMIT FOR THE XFAIL LIST. PLEASE CONTACT THE BUILDBOT ADMIN.
sergiodj+
2017-06-27 11:24:19 UTC
Permalink
Buildslave:
ubuntu-trusty-aarch32-1

Full Build URL:
<http://gdb-build.sergiodj.net/builders/Ubuntu-AArch32-m32/builds/906>

Commit(s) tested:
db665f427ca781d631d9e29b1bb744fb11ffcbba

Author(s) (in the same order as the commits):
Simon Marchi <***@ericsson.com>

Subject:
darwin: Do not add a dummy thread

Testsuite log (gdb.sum and gdb.log) URL(s):
<http://gdb-build.sergiodj.net/results/Ubuntu-AArch32-m32/db/db665f427ca781d631d9e29b1bb744fb11ffcbba/>

*** Diff to previous build ***
============================
PASS -> FAIL: gdb.base/step-over-syscall.exp: clone: displaced=off: single step over clone
new FAIL: gdb.threads/interrupt-while-step-over.exp: displaced-stepping=off: iter=4: wait for stops
new FAIL: gdb.threads/interrupt-while-step-over.exp: displaced-stepping=off: iter=6: wait for stops
new FAIL: gdb.threads/interrupt-while-step-over.exp: displaced-stepping=off: iter=7: wait for stops
new FAIL: gdb.threads/interrupt-while-step-over.exp: displaced-stepping=off: iter=10: wait for stops
new FAIL: gdb.threads/interrupt-while-step-over.exp: displaced-stepping=off: iter=15: wait for stops
new FAIL: gdb.threads/interrupt-while-step-over.exp: displaced-stepping=off: iter=17: wait for stops
============================


*** Complete list of XFAILs for this builder ***

FAILURE TO OBTAIN THE COMMIT FOR THE XFAIL LIST. PLEASE CONTACT THE BUILDBOT ADMIN.
Loading...